Target
Platelet-activating factor receptor
Ligand
BDBM50286026
Substrate
Meas. Tech.
ChEMBL_155151 (CHEMBL760191)
Ki
100±n/a nM
Citation
 Sheppard, GSDavidsen, SKCarrera, GMPireh, DHolms, JHHeyman, HRSteinman, DHCurtin, MLConway, RGRhein, DAAlbert, DHTapang, PMagoc, TJSummers, JB Synthesis and evaluation of water soluble indole pyrrolothiazole paf antagonists Bioorg Med Chem Lett 5:2913-2918 (1995)    Article 
Target
Name:
Platelet-activating factor receptor
Synonyms:
PAF-R PTAFR_CAVPO Platelet-activating factor receptor
Type:
Protein
Mol. Mass.:
39005.63
Organism:
Cavia porcellus
Description:
Residue:
342
  
Inhibitor
Name:
BDBM50286026
Synonyms:
1-Carbamoylimino-5-{(R)-7-[1-dimethylcarbamoyl-6-(4-fluoro-phenyl)-1H-indole-3-carbonyl]-1H-pyrrolo[1,2-c]thiazol-3-yl}-1,2-dihydro-pyridinium | CHEMBL98046
Type:
Small organic molecule
Emp. Form.:
C30H26FN6O3S
Mol. Mass.:
569.629
SMILES:
CN(C)C(=O)n1cc(C(=O)c2ccn3[C@H](SCc23)c2ccc[n+](NC(N)=O)c2)c2ccc(cc12)-c1ccc(F)cc1
: