Target
Platelet-activating factor receptor
Ligand
BDBM50004633
Substrate
Meas. Tech.
ChEBML_164930
IC50
4.90±n/a nM
Citation
 Cooper, KFray, MJParry, MJRichardson, KSteele, J Enantiodifferentiation of dihydropyridine PAF antagonists Bioorg Med Chem Lett 5:3085-3090 (1995)    Article 
Target
Name:
Platelet-activating factor receptor
Synonyms:
PAF Platelet activating factor PAFR PTAFR_HUMAN Platelet-activating factor receptor
Type:
Enzyme Catalytic Domain
Mol. Mass.:
39219.60
Organism:
Homo sapiens (Human)
Description:
PAF Platelet activating factor PTAFR HUMAN::P25105
Residue:
342
  
Inhibitor
Name:
BDBM50004633
Synonyms:
(S)-4-(2-Chloro-phenyl)-6-methyl-2-[4-(2-methyl-imidazo[4,5-c]pyridin-1-yl)-phenyl]-5-(pyridin-2-ylcarbamoyl)-1,4-dihydro-pyridine-3-carboxylic acid ethyl ester 4-(2-Chloro-phenyl)-6-methyl-2-[4-(2-methyl-imidazo[4,5-c]pyridin-1-yl)-phenyl]-5-(pyridin-2-ylcarbamoyl)-nicotinic acid ethyl ester UK-74505
Type:
Small organic molecule
Emp. Form.:
C34H29ClN6O3
Mol. Mass.:
605.085
SMILES:
CCOC(=O)C1=C(N=C(C)C(C1c1ccccc1Cl)C(=O)Nc1ccccn1)c1ccc(cc1)-n1c(C)nc2cnccc12
: