Target
Interstitial collagenase
Ligand
BDBM50286342
Substrate
Meas. Tech.
ChEBML_49511
Ki
5±n/a nM
Citation
 Singh, JConzentino, PCundy, KGainor, JAGilliam, CLGordon, TDJohnson, JAMorgan, BASchneider, EDWahl, RCWhipple, DA Relationship between structure and bioavailability in a series of hydroxamate based metalloprotease inhibitors Bioorg Med Chem Lett 5:337-342 (1995)    Article 
Target
Name:
Interstitial collagenase
Synonyms:
CLG MMP1 Matrix metalloproteinase-1 | Matrix metalloproteinase-1 (MMP-1)
Type:
Enzyme
Mol. Mass.:
54010.26
Organism:
Homo sapiens (Human)
Description:
P03956
Residue:
469
  
Inhibitor
Name:
BDBM50286342
Synonyms:
(R)-N*4*-Hydroxy-N*1*-[(S)-2-(1H-indol-3-yl)-1-(2-methylsulfanyl-ethylcarbamoyl)-ethyl]-2-isobutyl-succinamide | CHEMBL116972
Type:
Small organic molecule
Emp. Form.:
C22H32N4O4S
Mol. Mass.:
448.579
SMILES:
CSCCNC(=O)[C@H](Cc1c[nH]c2ccccc12)NC(=O)[C@H](CC(C)C)CC(=O)NO
: