Target
5-hydroxytryptamine receptor 1A
Ligand
BDBM50286670
Substrate
Meas. Tech.
ChEMBL_608 (CHEMBL615477)
EC50
95±n/a nM
Citation
 Perez, MPauwels, PPalmier, CJohn, GWValentin, JPHalazy, S 5-O-Carboxymethyl piperazide derivatives of serotonin: a new class of potent and selective 5-HT1D receptor agonists Bioorg Med Chem Lett 5:663-666 (1995)    Article 
Target
Name:
5-hydroxytryptamine receptor 1A
Synonyms:
5-HT-1A 5-hydroxytryptamine receptor 1A (5-HT-1A) ADRB2RL1 Dopamine D2 receptor and serotonin 1a receptor HTR1A | Serotonin receptor 1A
Type:
Mol. Mass.:
46122.49
Organism:
Homo sapiens (Human)
Description:
Residue:
422
  
Inhibitor
Name:
BDBM50286670
Synonyms:
2-[3-(2-Amino-ethyl)-1H-indol-5-yloxy]-1-(4-naphthalen-1-yl-piperazin-1-yl)-ethanone | CHEMBL160581
Type:
Small organic molecule
Emp. Form.:
C26H28N4O2
Mol. Mass.:
428.5261
SMILES:
NCCc1c[nH]c2ccc(OCC(=O)N3CCN(CC3)c3cccc4ccccc34)cc12
: