Target
Alpha-1A/Alpha-1B/Alpha-1D adrenergic receptor
Ligand
BDBM50286670
Substrate
Meas. Tech.
ChEMBL_33305 (CHEMBL646158)
IC50
>1000±n/a nM
Citation
 Perez, MPauwels, PPalmier, CJohn, GWValentin, JPHalazy, S 5-O-Carboxymethyl piperazide derivatives of serotonin: a new class of potent and selective 5-HT1D receptor agonists Bioorg Med Chem Lett 5:663-666 (1995)    Article 
Target
Name:
Alpha-1A/Alpha-1B/Alpha-1D adrenergic receptor
Synonyms:
Adrenergic receptor alpha-1
Type:
Mol. Mass.:
Description:
ASSAY_ID of ChEMBL is 306566
Components:
This complex has 3 components.
Component 1
Name:
Alpha-1D adrenergic receptor
Synonyms:
ADA1D_HUMAN ADRA1D Adrenergic receptor alpha Alpha 1D-adrenoreceptor Alpha-1D adrenoceptor adrenergic Alpha1D
Type:
Enzyme Catalytic Domain
Mol. Mass.:
60485.82
Organism:
Homo sapiens (Human)
Description:
adrenergic Alpha1D ADRA1D HUMAN::P25100
Residue:
572
  
Component 2
Name:
Alpha-1B adrenergic receptor
Synonyms:
ADA1B_HUMAN Adrenergic alpha1B Adrenergic receptor alpha Alpha 1B-adrenoreceptor | Alpha-1B adrenergic receptor
Type:
Enzyme
Mol. Mass.:
56862.13
Organism:
Homo sapiens (Human)
Description:
P35368
Residue:
520
  
Component 3
Name:
Alpha-1A adrenergic receptor
Synonyms:
ADA1A_HUMAN ADRA1C Alpha 1A-adrenoceptor Alpha adrenergic receptor 1a Alpha-adrenergic receptor 1c adrenergic Alpha1 | adrenergic Alpha1C
Type:
Cell-surface receptors
Mol. Mass.:
51511.67
Organism:
Homo sapiens (Human)
Description:
P35348
Residue:
466
  
Inhibitor
Name:
BDBM50286670
Synonyms:
2-[3-(2-Amino-ethyl)-1H-indol-5-yloxy]-1-(4-naphthalen-1-yl-piperazin-1-yl)-ethanone | CHEMBL160581
Type:
Small organic molecule
Emp. Form.:
C26H28N4O2
Mol. Mass.:
428.5261
SMILES:
NCCc1c[nH]c2ccc(OCC(=O)N3CCN(CC3)c3cccc4ccccc34)cc12
: