Target
Cholecystokinin receptor type A
Ligand
BDBM50286884
Substrate
Meas. Tech.
ChEBML_47664
IC50
293±n/a nM
Citation
 Semple, GRyder, HKendrick, DASzelke, MOhta, MSatoh, MNishida, AAkuzawa, SMiyata, K Synthesis and biological activity of 1-alkylcarbonylmethyl analogues of YM022 Bioorg Med Chem Lett 6:51-54 (1996)    Article 
Target
Name:
Cholecystokinin receptor type A
Synonyms:
CCK-A receptor CCK1-R CCKAR_HUMAN Cholecystokinin receptor Cholecystokinin-1 Receptor
Type:
G Protein-Coupled Receptor (GPCR)
Mol. Mass.:
47859.34
Organism:
Homo sapiens (Human)
Description:
Stable expression of human CCK-1 receptors in HEK 293 cells.
Residue:
428
  
Inhibitor
Name:
BDBM50286884
Synonyms:
1-{1-[2-(1-Methyl-cyclopentyl)-2-oxo-ethyl]-2-oxo-5-phenyl-2,3-dihydro-1H-benzo[e][1,4]diazepin-3-yl}-3-m-tolyl-urea | CHEMBL151483
Type:
Small organic molecule
Emp. Form.:
C31H32N4O3
Mol. Mass.:
508.6108
SMILES:
Cc1cccc(NC(=O)NC2N=C(c3ccccc3)c3ccccc3N(CC(=O)C3(C)CCCC3)C2=O)c1
: