Target
Gastrin/cholecystokinin type B receptor
Ligand
BDBM50286893
Substrate
Meas. Tech.
ChEBML_48442
IC50
2.4±n/a nM
Citation
 Semple, GRyder, HKendrick, DASzelke, MOhta, MSatoh, MNishida, AAkuzawa, SMiyata, K Synthesis and biological activity of 1-alkylcarbonylmethyl analogues of YM022 Bioorg Med Chem Lett 6:51-54 (1996)    Article 
Target
Name:
Gastrin/cholecystokinin type B receptor
Synonyms:
Cckbr Cholecystokinin B receptor GASR_RAT | Gastrin/cholecystokinin type B receptor
Type:
Enzyme Catalytic Domain
Mol. Mass.:
48980.43
Organism:
RAT
Description:
Cholecystokinin A CCKBR RAT::P30553
Residue:
452
  
Inhibitor
Name:
BDBM50286893
Synonyms:
1-[1-(2-Cyclobutyl-2-oxo-ethyl)-2-oxo-5-phenyl-2,3-dihydro-1H-benzo[e][1,4]diazepin-3-yl]-3-m-tolyl-urea | CHEMBL358420
Type:
Small organic molecule
Emp. Form.:
C29H28N4O3
Mol. Mass.:
480.5576
SMILES:
Cc1cccc(NC(=O)NC2N=C(c3ccccc3)c3ccccc3N(CC(=O)C3CCC3)C2=O)c1
: