Target
Gag-Pol polyprotein [489-587]
Ligand
BDBM50287000
Substrate
Meas. Tech.
ChEBML_159467
pH
4.7±n/a
IC50
68±n/a nM
Comments
extracted
Citation
 Steinbaugh, BAHamilton, HWPrasad, JVPara, KSJ., TPFerguson, DLunney, EABlankley, CJ A topliss tree analysis of the HIV-protease inhibitory activity of 6-phenyl-4-hydroxy-pyran-2-ones Bioorg Med Chem Lett 6:1099-1104 (1996)    Article 
Target
Name:
Gag-Pol polyprotein [489-587]
Synonyms:
Human immunodeficiency virus type 1 protease Pol polyprotein | gag-pol
Type:
Enzyme Subunit
Mol. Mass.:
10781.16
Organism:
Human immunodeficiency virus type 1
Description:
P04585[489-587]
Residue:
99
  
Inhibitor
Name:
BDBM50287000
Synonyms:
4-[4-Hydroxy-5-(2-isopropyl-phenylsulfanyl)-6-oxo-6H-pyran-2-yl]-benzoic acid | CHEMBL275560
Type:
Small organic molecule
Emp. Form.:
C21H18O5S
Mol. Mass.:
382.43
SMILES:
CC(C)c1ccccc1Sc1c(O)cc(oc1=O)-c1ccc(cc1)C(O)=O
: