Target
Lysosomal alpha-glucosidase
Ligand
BDBM50287006
Substrate
Meas. Tech.
ChEBML_34537
Ki
29400±n/a nM
Citation
 Qian, XMorís-Varas, FWong, CH Synthesis of C2-symmetrical polyhydroxyazepanes as inhibitors of glycosidases Bioorg Med Chem Lett 6:1117-1122 (1996)    Article 
Target
Name:
Lysosomal alpha-glucosidase
Synonyms:
70 kDa lysosomal alpha-glucosidase Acid maltase Alpha glucosidase LYAG_HUMAN
Type:
PROTEIN
Mol. Mass.:
105312.45
Organism:
Homo sapiens (Human)
Description:
ChEMBL_1506060
Residue:
952
  
Inhibitor
Name:
BDBM50287006
Synonyms:
Azepane-3,4,5,6-tetraol | CHEMBL13922
Type:
Small organic molecule
Emp. Form.:
C6H13NO4
Mol. Mass.:
163.1717
SMILES:
O[C@H]1CNC[C@H](O)[C@@H](O)[C@@H]1O
: