Target
D(3) dopamine receptor
Ligand
BDBM50287163
Substrate
Meas. Tech.
ChEBML_62290
Ki
50±n/a nM
Citation
 Glase, SAAkunne, HCHeffner, TGJohnson, SJKesten, SRMacKenzie, RGManley, PJPugsley, TAWright, JLWise, LD 4-bromo-1-methoxy-N-[2-(4-aryl-1-piperazinyl)ethyl]-2-naphthalenecarboxamides: Selective dopamine D3 receptor partial agonists Bioorg Med Chem Lett 6:1361-1366 (1996)    Article 
Target
Name:
D(3) dopamine receptor
Synonyms:
DOPAMINE D3 DRD3_HUMAN Dopamine D3 receptor (D3) Dopamine receptor Dopamine receptor D3
Type:
Mol. Mass.:
44243.43
Organism:
Homo sapiens (Human)
Description:
Residue:
400
  
Inhibitor
Name:
BDBM50287163
Synonyms:
4-Bromo-1-methoxy-naphthalene-2-carboxylic acid {2-[4-(2,3-dimethyl-phenyl)-piperazin-1-yl]-ethyl}-amide | CHEMBL29182
Type:
Small organic molecule
Emp. Form.:
C26H30BrN3O2
Mol. Mass.:
496.439
SMILES:
COc1c(cc(Br)c2ccccc12)C(=O)NCCN1CCN(CC1)c1cccc(C)c1C
: