Target
Type-1 angiotensin II receptor B
Ligand
BDBM50287291
Substrate
Meas. Tech.
ChEBML_36639
IC50
0.660000±n/a nM
Citation
 Hirata, TNomiyama, JSakae, NNishimura, KYokomoto, MInoue, STamura, KOkuhira, MAmano, HNagao, Y Acyliminothiadiazoline derivatives: New, highly potent, and orally active angiotensin II receptor antagonists Bioorg Med Chem Lett 6:1469-1474 (1996)    Article 
Target
Name:
Type-1 angiotensin II receptor B
Synonyms:
AGTRB_RAT Agtr1 Angiotensin II AT1B Angiotensin II type 1b (AT-1b) receptor Type-1B angiotensin II receptor
Type:
Enzyme Catalytic Domain
Mol. Mass.:
40929.44
Organism:
RAT
Description:
Angiotensin II AT1B 0 RAT::P29089
Residue:
359
  
Inhibitor
Name:
BDBM50287291
Synonyms:
CHEMBL35381 | N-[5-Ethyl-3-[2'-(1H-tetrazol-5-yl)-biphenyl-4-ylmethyl]-3H-[1,3,4]thiadiazol-(2Z)-ylidene]-phthalamic acid
Type:
Small organic molecule
Emp. Form.:
C26H21N7O3S
Mol. Mass.:
511.555
SMILES:
CCc1nn(Cc2ccc(cc2)-c2ccccc2-c2nnn[nH]2)c(=NC(=O)c2ccccc2C(O)=O)s1
: