Target
Stromelysin-1
Ligand
BDBM50287379
Substrate
Meas. Tech.
ChEBML_205490
IC50
0.800000±n/a nM
Citation
 Chen, JJZhang, YHammond, SDewdney, NHo, TLin, XBrowner, MFCastelhano, AL Design, synthesis, activity, and structure of a novel class of matrix metalloproteinase inhibitors containing a heterocyclic P2′-P3′ amide bond isostere Bioorg Med Chem Lett 6:1601-1606 (1996)    Article 
Target
Name:
Stromelysin-1
Synonyms:
MMP-3 MMP3_HUMAN Matrix metalloproteinase 3 Matrix metalloproteinase-3 (MMP-3) SL-1 Stromelysin 1 | Transin-1
Type:
Enzyme
Mol. Mass.:
53973.13
Organism:
Homo sapiens (Human)
Description:
P08254
Residue:
477
  
Inhibitor
Name:
BDBM50287379
Synonyms:
4-[(S)-2-((R)-2-Hydroxycarbamoylmethyl-4-methyl-pentanoylamino)-4-methyl-pentanoylamino]-benzoic acid methyl ester RS-39066
Type:
Small organic molecule
Emp. Form.:
C22H33N3O6
Mol. Mass.:
435.5139
SMILES:
COC(=O)c1ccc(NC(=O)[C@H](CC(C)C)NC(=O)[C@H](CC(C)C)CC(=O)NO)cc1
: