Target
Matrilysin
Ligand
BDBM50287377
Substrate
Meas. Tech.
ChEBML_102104
IC50
10±n/a nM
Citation
 Chen, JJZhang, YHammond, SDewdney, NHo, TLin, XBrowner, MFCastelhano, AL Design, synthesis, activity, and structure of a novel class of matrix metalloproteinase inhibitors containing a heterocyclic P2′-P3′ amide bond isostere Bioorg Med Chem Lett 6:1601-1606 (1996)    Article 
Target
Name:
Matrilysin
Synonyms:
MMP7 MPSL1 Matrix metalloproteinase-7 (MMP-7) PUMP1
Type:
Enzyme
Mol. Mass.:
29681.54
Organism:
Homo sapiens (Human)
Description:
P09237
Residue:
267
  
Inhibitor
Name:
BDBM50287377
Synonyms:
(R)-N*4*-Hydroxy-2-isobutyl-N*1*-[(S)-3-methyl-1-(6-trifluoromethyl-1H-benzoimidazol-2-yl)-butyl]-succinamide | CHEMBL289513
Type:
Small organic molecule
Emp. Form.:
C21H29F3N4O3
Mol. Mass.:
442.4752
SMILES:
CC(C)C[C@H](CC(=O)NO)C(=O)N[C@@H](CC(C)C)c1nc2ccc(cc2[nH]1)C(F)(F)F
: