Target
Sterol O-acyltransferase 1
Ligand
BDBM50287518
Substrate
Meas. Tech.
ChEBML_90523
IC50
890±n/a nM
Citation
 Purchase, CFWhite, ADAnderson, MKBocan, TMBousley, RFHamelehle, KLHoman, RKrause, BRLee, PMueller, SBSpeyer, CStanfield, RLReindel, JF Tetrazole-substituted ureas as inhibitors of acyl-CoA:cholesterol O-acyltransferase (ACAT). A novel preparation of ureas from weakly nucleophilic amines Bioorg Med Chem Lett 6:1753-1758 (1996)    Article 
Target
Name:
Sterol O-acyltransferase 1
Synonyms:
ACAT-1 Acetoacetyl-CoA thiolase Acyl coenzyme A:cholesterol acyltransferase 1 Cholesterol acyltransferase 1 Soat1 | Sterol O-acyltransferase 1
Type:
PROTEIN
Mol. Mass.:
63818.83
Organism:
Mus musculus
Description:
ChEMBL_90523
Residue:
540
  
Inhibitor
Name:
BDBM50287518
Synonyms:
1-(2-Dodecyl-2H-tetrazol-5-yl)-1-phenyl-3-(2,4,6-trimethoxy-phenyl)-urea | CHEMBL49524
Type:
Small organic molecule
Emp. Form.:
C29H42N6O4
Mol. Mass.:
538.6816
SMILES:
CCCCCCCCCCCCn1nnc(n1)N(C(=O)Nc1c(OC)cc(OC)cc1OC)c1ccccc1
: