Target
GTPase HRas
Ligand
BDBM50287952
Substrate
Meas. Tech.
ChEBML_143166
IC50
27000±n/a nM
Citation
 Wolin, RWang, DKelly, JAfonso, AJames, LKirschmeier, PMcPhail, AT Synthesis and evaluation of pyrazolo[3,4-b]quinoline ribofuranosides and their derivatives as inhibitors of oncogenic Ras Bioorg Med Chem Lett 6:195-200 (1996)    Article 
Target
Name:
GTPase HRas
Synonyms:
GTPase HRas, N-terminally processed H-Ras-1 HRAS1 His6-Ha-Ras-CVLS Transforming protein p21 Wild-type Ha-Ras p21ras
Type:
Other Protein Type
Mol. Mass.:
21293.37
Organism:
Homo sapiens (Human)
Description:
P01112
Residue:
189
  
Inhibitor
Name:
BDBM50287952
Synonyms:
CHEMBL304717 | N-{4-[(2S,6R)-2-(tert-Butyl-dimethyl-silanyloxymethyl)-6-(4-chloro-6-methoxy-3-methyl-pyrazolo[3,4-b]quinolin-1-yl)-morpholine-4-sulfonyl]-phenyl}-acetamide
Type:
Small organic molecule
Emp. Form.:
C31H40ClN5O6SSi
Mol. Mass.:
674.283
SMILES:
COc1ccc2nc3n(nc(C)c3c(Cl)c2c1)[C@H]1CN(C[C@@H](CO[Si](C)(C)C(C)(C)C)O1)S(=O)(=O)c1ccc(NC(C)=O)cc1
: