Target
GTPase HRas
Ligand
BDBM50287959
Substrate
Meas. Tech.
ChEBML_143166
IC50
7000±n/a nM
Citation
 Wolin, RWang, DKelly, JAfonso, AJames, LKirschmeier, PMcPhail, AT Synthesis and evaluation of pyrazolo[3,4-b]quinoline ribofuranosides and their derivatives as inhibitors of oncogenic Ras Bioorg Med Chem Lett 6:195-200 (1996)    Article 
Target
Name:
GTPase HRas
Synonyms:
GTPase HRas, N-terminally processed H-Ras-1 HRAS1 His6-Ha-Ras-CVLS Transforming protein p21 Wild-type Ha-Ras p21ras
Type:
Other Protein Type
Mol. Mass.:
21293.37
Organism:
Homo sapiens (Human)
Description:
P01112
Residue:
189
  
Inhibitor
Name:
BDBM50287959
Synonyms:
(E)-4-[(2R,6R)-6-(4-Chloro-6-methoxy-3-methyl-pyrazolo[3,4-b]quinolin-1-yl)-4-(4-nitro-benzenesulfonyl)-morpholin-2-yl]-1-phenyl-but-2-en-1-one | CHEMBL304474
Type:
Small organic molecule
Emp. Form.:
C32H28ClN5O7S
Mol. Mass.:
662.112
SMILES:
COc1ccc2nc3n(nc(C)c3c(Cl)c2c1)[C@H]1CN(C[C@H](O1)C=CCC(=O)c1ccccc1)S(=O)(=O)c1ccc(cc1)[N+]([O-])=O
: