Target
Adenosine deaminase
Ligand
BDBM50288071
Substrate
Meas. Tech.
ChEBML_30813
Ki
188±n/a nM
Citation
 Pragnacharyulu, PVLu, PJAbushanab, E Adenosine deaminase inhibitors. Synthesis and biological evaluation of chain modified analogs of (+)-EHNA Bioorg Med Chem Lett 6:2417-2420 (1996)    Article 
Target
Name:
Adenosine deaminase
Synonyms:
ADA Adenosine aminohydrolase
Type:
Enzyme
Mol. Mass.:
40910.44
Organism:
Bos taurus (bovine)
Description:
Residue:
363
  
Inhibitor
Name:
BDBM50288071
Synonyms:
(2S,3R)-3-(6-Amino-purin-9-yl)-non-5-yn-2-ol CHEMBL311182
Type:
Small organic molecule
Emp. Form.:
C14H19N5O
Mol. Mass.:
273.3336
SMILES:
CCCC#CC[C@H]([C@H](C)O)n1cnc2c(N)ncnc12
: