Target
Dipeptidyl peptidase 4
Ligand
BDBM50288307
Substrate
Meas. Tech.
ChEBML_53349
Ki
0.800000±n/a nM
Citation
 Ashworth, DMAtrash, BBaker, GRBaxter, AJJenkins, PDJones, DMSzelke, M 4-cyanothiazolidides as very potent, stable inhibitors of dipeptidyl peptidase IV Bioorg Med Chem Lett 6:2745-2748 (1996)    Article 
Target
Name:
Dipeptidyl peptidase 4
Synonyms:
ADABP Adenosine deaminase complexing protein 2 CD_antigen=CD26 DPP4 DPPIV Dipeptidyl peptidase 4 (DPP IV) Dipeptidyl peptidase 4 (DPP4) Dipeptidyl peptidase 4 membrane form Dipeptidyl peptidase IV Dipeptidyl peptidase IV (DDP-IV) Dipeptidyl peptidase IV membrane form Dipeptidyl peptidase-IV (DPP-4) T-cell activation antigen CD26 | TP103
Type:
Enzyme
Mol. Mass.:
88271.01
Organism:
Homo sapiens (Human)
Description:
P27487
Residue:
766
  
Inhibitor
Name:
BDBM50288307
Synonyms:
(R)-3-(2-Amino-2-cyclohexyl-acetyl)-thiazolidine-4-carbonitrile | CHEMBL316560
Type:
Small organic molecule
Emp. Form.:
C12H19N3OS
Mol. Mass.:
253.364
SMILES:
NC(C1CCCCC1)C(=O)N1CSC[C@H]1C#N
: