Target
Tissue-type plasminogen activator
Ligand
BDBM50288407
Substrate
Meas. Tech.
ChEBML_225390
Ki
750±n/a nM
Citation
 Galemmo, RAFevig, JMCarini, DJCacciola, JWells, BLHillyer, GLJr., JBRossi, KAStouten, PFAlexander, RSHilmer, RBostrom, LAbelman, MMLee, SLWeber, PCKettner, CAKnabb, RMWexler, RR (N-acyl-N-alkyl)glycyl borolysine analogs: A new class of potent thrombin inhibitors Bioorg Med Chem Lett 6:2913-2918 (1996)    Article 
Target
Name:
Tissue-type plasminogen activator
Synonyms:
Alteplase Reteplase Thrombin receptor protein Tissue-type plasminogen activator (tPA) t-PA t-plasminogen activator
Type:
Enzyme
Mol. Mass.:
62931.08
Organism:
Homo sapiens (Human)
Description:
Residue:
562
  
Inhibitor
Name:
BDBM50288407
Synonyms:
CHEMBL317137 | N-[(5-Amino-1-dihydroxyboranyl-pentylcarbamoyl)-methyl]-N-cyclopropyl-3-phenyl-propionamide
Type:
Small organic molecule
Emp. Form.:
C19H30BN3O4
Mol. Mass.:
375.27
SMILES:
NCCCC[C@H](NC(=O)CN(C1CC1)C(=O)CCc1ccccc1)B(O)O
: