Target
Serine protease 1
Ligand
BDBM50288406
Substrate
Meas. Tech.
ChEBML_210658
Ki
0.045000±n/a nM
Citation
 Galemmo, RAFevig, JMCarini, DJCacciola, JWells, BLHillyer, GLJr., JBRossi, KAStouten, PFAlexander, RSHilmer, RBostrom, LAbelman, MMLee, SLWeber, PCKettner, CAKnabb, RMWexler, RR (N-acyl-N-alkyl)glycyl borolysine analogs: A new class of potent thrombin inhibitors Bioorg Med Chem Lett 6:2913-2918 (1996)    Article 
Target
Name:
Serine protease 1
Synonyms:
Alpha-trypsin chain 1 Beta-trypsin PRSS1 TRP1 TRY1_HUMAN Thrombin & trypsin Trypsin I | Trypsin-1
Type:
Enzyme
Mol. Mass.:
26557.80
Organism:
Homo sapiens (Human)
Description:
P07477
Residue:
247
  
Inhibitor
Name:
BDBM50288406
Synonyms:
1-(2-Acetylamino-3-phenyl-propionyl)-pyrrolidine-2-carboxylic acid (1-dihydroxyboranyl-4-guanidino-butyl)-amide CHEMBL290376
Type:
Small organic molecule
Emp. Form.:
C21H33BN6O5
Mol. Mass.:
460.335
SMILES:
CC(=O)N[C@H](Cc1ccccc1)C(=O)N1CCC[C@H]1C(=O)N[C@@H](CCCNC(N)=N)B(O)O
: