Target
Plasminogen
Ligand
BDBM50288409
Substrate
Meas. Tech.
ChEBML_155601
Ki
170±n/a nM
Citation
 Galemmo, RAFevig, JMCarini, DJCacciola, JWells, BLHillyer, GLJr., JBRossi, KAStouten, PFAlexander, RSHilmer, RBostrom, LAbelman, MMLee, SLWeber, PCKettner, CAKnabb, RMWexler, RR (N-acyl-N-alkyl)glycyl borolysine analogs: A new class of potent thrombin inhibitors Bioorg Med Chem Lett 6:2913-2918 (1996)    Article 
Target
Name:
Plasminogen
Synonyms:
Activation peptide PLG Plasmin Plasmin heavy chain A, short form | Plasmin light chain B
Type:
Enzyme
Mol. Mass.:
90579.18
Organism:
Homo sapiens (Human)
Description:
Residue:
810
  
Inhibitor
Name:
BDBM50288409
Synonyms:
CHEMBL99309 | N-[(5-Amino-1-dihydroxyboranyl-pentylcarbamoyl)-methyl]-N-phenethyl-3-phenyl-propionamide
Type:
Small organic molecule
Emp. Form.:
C24H34BN3O4
Mol. Mass.:
439.355
SMILES:
NCCCC[C@H](NC(=O)CN(CCc1ccccc1)C(=O)CCc1ccccc1)B(O)O
: