Target
Prostatic acid phosphatase
Ligand
BDBM50288651
Substrate
Meas. Tech.
ChEBML_158626
IC50
16000±n/a nM
Citation
 Schwender, CFBeers, SAMalloy, EACinicola, JJWustrow, DJDemarest, KDJordan, J Benzylphosphonic acid inhibitors of human prostatic acid phosphatase Bioorg Med Chem Lett 6:311-314 (1996)    Article 
Target
Name:
Prostatic acid phosphatase
Synonyms:
ACP3 PPAP_HUMAN | Prostatic acid phosphatase
Type:
PROTEIN
Mol. Mass.:
44563.07
Organism:
Homo sapiens (Human)
Description:
ChEMBL_158625
Residue:
386
  
Inhibitor
Name:
BDBM50288651
Synonyms:
(2-Biphenyl-4-yl-1-phenyl-ethyl)-phosphonic acid | CHEMBL107463
Type:
Small organic molecule
Emp. Form.:
C20H19O3P
Mol. Mass.:
338.3368
SMILES:
OP(O)(=O)C(Cc1ccc(cc1)-c1ccccc1)c1ccccc1
: