Target
Prostatic acid phosphatase
Ligand
BDBM50288652
Substrate
Meas. Tech.
ChEBML_158626
IC50
67000±n/a nM
Citation
 Schwender, CFBeers, SAMalloy, EACinicola, JJWustrow, DJDemarest, KDJordan, J Benzylphosphonic acid inhibitors of human prostatic acid phosphatase Bioorg Med Chem Lett 6:311-314 (1996)    Article 
Target
Name:
Prostatic acid phosphatase
Synonyms:
ACP3 PPAP_HUMAN | Prostatic acid phosphatase
Type:
PROTEIN
Mol. Mass.:
44563.07
Organism:
Homo sapiens (Human)
Description:
ChEMBL_158625
Residue:
386
  
Inhibitor
Name:
BDBM50288652
Synonyms:
(Biphenyl-4-yl-phenyl-methyl)-phosphonic acid | CHEMBL104006
Type:
Small organic molecule
Emp. Form.:
C19H17O3P
Mol. Mass.:
324.3102
SMILES:
OP(O)(=O)C(c1ccccc1)c1ccc(cc1)-c1ccccc1
: