Target
Prostatic acid phosphatase
Ligand
BDBM50288660
Substrate
Meas. Tech.
ChEBML_158626
IC50
67000±n/a nM
Citation
 Schwender, CFBeers, SAMalloy, EACinicola, JJWustrow, DJDemarest, KDJordan, J Benzylphosphonic acid inhibitors of human prostatic acid phosphatase Bioorg Med Chem Lett 6:311-314 (1996)    Article 
Target
Name:
Prostatic acid phosphatase
Synonyms:
ACP3 PPAP_HUMAN | Prostatic acid phosphatase
Type:
PROTEIN
Mol. Mass.:
44563.07
Organism:
Homo sapiens (Human)
Description:
ChEMBL_158625
Residue:
386
  
Inhibitor
Name:
BDBM50288660
Synonyms:
CHEMBL107374 | [Phenyl-(3-trifluoromethyl-phenyl)-methyl]-phosphonic acid
Type:
Small organic molecule
Emp. Form.:
C14H12F3O3P
Mol. Mass.:
316.2123
SMILES:
OP(O)(=O)C(c1ccccc1)c1cccc(c1)C(F)(F)F
: