Target
5-hydroxytryptamine receptor 5A
Ligand
BDBM50288782
Substrate
Meas. Tech.
ChEBML_1530
Ki
379±n/a nM
Citation
 Appelberg, UMohell, NHacksell, U Derivatives of 2-arylcyclopropylamine: Synthesis and interactions with 5-HT1A receptors. Bioorg Med Chem Lett 6:415-420 (1996)    Article 
Target
Name:
5-hydroxytryptamine receptor 5A
Synonyms:
5-HT-5A 5-hydroxytryptamine receptor 5A 5ht5a REC17 Serotonin receptor 5A
Type:
Enzyme Catalytic Domain
Mol. Mass.:
40684.21
Organism:
RAT
Description:
5-HT5a HTR5A RAT::P35364
Residue:
357
  
Inhibitor
Name:
BDBM50288782
Synonyms:
2-((1S,2R)-2-Dipropylaminomethyl-cyclopropyl)-phenol | CHEMBL133433
Type:
Small organic molecule
Emp. Form.:
C16H25NO
Mol. Mass.:
247.3758
SMILES:
CCCN(CCC)C[C@@H]1C[C@@H]1c1ccccc1O
: