Target
D(2) dopamine receptor
Ligand
BDBM82517
Substrate
Meas. Tech.
ChEBML_62406
Ki
64±n/a nM
Citation
 López-Rodríguez, MLMorcillo, MRosado, MBenhamu, BSanz, AM 2-[4-(o-methoxyphenyl)piperazin-1-ylmethyl]-1,3-dioxoperhydroimidazo[1,5-a]pyridine as a new selective 5-HT1A receptor ligand Bioorg Med Chem Lett 6:689-694 (1996)    Article 
Target
Name:
D(2) dopamine receptor
Synonyms:
DOPAMINE D2 DOPAMINE D2 Short Dopamine D2 receptor Drd2
Type:
G Protein-Coupled Receptor (GPCR)
Mol. Mass.:
50931.60
Organism:
Rattus norvegicus (rat)
Description:
P61169
Residue:
444
  
Inhibitor
Name:
BDBM82517
Synonyms:
2-{4-[4-(2-Methoxy-phenyl)-piperazin-1-yl]-butyl}-isoindole-1,3-dione CHEMBL126632 NAN-190 | NSC_107966
Type:
Small organic molecule
Emp. Form.:
C23H27N3O3
Mol. Mass.:
393.4788
SMILES:
COc1ccccc1N1CCN(CCCCN2C(=O)c3ccccc3C2=O)CC1
: