Target
Acyl-CoA:cholesterol acyltransferase
Ligand
BDBM50289036
Substrate
Meas. Tech.
ChEBML_28171
IC50
15±n/a nM
Citation
 Sliskovic, DRPicard, JARoark, WHEssenburg, ADKrause, BRMinton, LLReindel, JFStanfield, RL Inhibitors of acyl-CoA: cholesterol O-acyl transferase (ACAT) as hypocholesterolemic agents. The synthesis and biological activity of a series of malonester amides Bioorg Med Chem Lett 6:713-718 (1996)    Article 
Target
Name:
Acyl-CoA:cholesterol acyltransferase
Synonyms:
ACAT
Type:
Mol. Mass.:
35405.31
Organism:
Oryctolagus cuniculus
Description:
Residue:
305
  
Inhibitor
Name:
BDBM50289036
Synonyms:
CHEMBL163325 | N-(2,6-Diisopropyl-phenyl)-malonamic acid 1,1-dimethyl-pentyl ester
Type:
Small organic molecule
Emp. Form.:
C22H35NO3
Mol. Mass.:
361.5182
SMILES:
CCCCC(C)(C)OC(=O)CC(=O)Nc1c(cccc1C(C)C)C(C)C
: