Target
Tryptophan 2,3-dioxygenase
Ligand
BDBM50289140
Substrate
Meas. Tech.
ChEBML_210838
Ki
50±n/a nM
Citation
 Madge, DJHazelwood, RIyer, RJones, HTSalter, M Novel tryptophan dioxygenase inhibitors and combined tryptophan dioxygenase/5-HT reuptake inhibitors Bioorg Med Chem Lett 6:857-860 (1996)    Article 
Target
Name:
Tryptophan 2,3-dioxygenase
Synonyms:
T23O_RAT TRPO Tdo2 Tryptophan oxygenase | Tryptophan pyrrolase
Type:
PROTEIN
Mol. Mass.:
47856.01
Organism:
Rattus norvegicus
Description:
ChEMBL_210838
Residue:
406
  
Inhibitor
Name:
BDBM50289140
Synonyms:
5-Fluoro-3-((E)-2-pyridin-3-yl-vinyl)-1H-indole | CHEMBL168956
Type:
Small organic molecule
Emp. Form.:
C15H11FN2
Mol. Mass.:
238.2596
SMILES:
Fc1ccc2[nH]cc(\C=C\c3cccnc3)c2c1
: