Target
Cholesteryl ester transfer protein
Ligand
BDBM50289153
Substrate
Meas. Tech.
ChEBML_48928
IC50
21000±n/a nM
Citation
 Xia, YMirzai, BChackalamannil, SCzarniecki, MWang, SClemmons, AAhn, HSBoykow, GC Substituted 1,3,5-triazines as cholesteryl ester transfer protein inhibitors Bioorg Med Chem Lett 6:919-922 (1996)    Article 
Target
Name:
Cholesteryl ester transfer protein
Synonyms:
CETP Cholesteryl ester transfer protein (CETP) | Lipid transfer protein I
Type:
Enzyme
Mol. Mass.:
54751.53
Organism:
Homo sapiens (Human)
Description:
P11597
Residue:
493
  
Inhibitor
Name:
BDBM50289153
Synonyms:
4-(2-{4-[4-(4-Chloro-phenyl)-piperazin-1-yl]-6-piperazin-1-yl-[1,3,5]triazin-2-ylamino}-ethyl)-benzene-1,2-diol | CHEMBL174248
Type:
Small organic molecule
Emp. Form.:
C25H31ClN8O2
Mol. Mass.:
511.019
SMILES:
Oc1ccc(CCNc2nc(nc(n2)N2CCN(CC2)c2ccc(Cl)cc2)N2CCNCC2)cc1O
: