Target
MHC class II antigen
Ligand
BDBM50289261
Substrate
Meas. Tech.
ChEBML_192856
IC50
390±n/a nM
Citation
 Cunningham, BRRivetna, MTolman, RLFlattery, SJNichols, EASchwartz, CDWicker, LSHermes, JDJones, AB SAR for MHC class II binding tetrapeptides: Correlation with potential binding site Bioorg Med Chem Lett 7:19-24 (1997)    Article 
Target
Name:
MHC class II antigen
Synonyms:
DR-1 HLA class II histocompatibility antigen DRB1-1 Human leukocyte antigen DR beta chain | MHC class I antigen DRB1*1
Type:
PROTEIN
Mol. Mass.:
29917.79
Organism:
Homo sapiens (Human)
Description:
ChEMBL_192854
Residue:
266
  
Inhibitor
Name:
BDBM50289261
Synonyms:
Acetic acid ((S)-1-{(S)-1-[(S)-1-((S)-1-carbamoyl-3-methyl-butylcarbamoyl)-ethylcarbamoyl]-2-methyl-propylcarbamoyl}-2-phenyl-ethylcarbamoyl)-methyl ester | CHEMBL310163
Type:
Small organic molecule
Emp. Form.:
C27H41N5O7
Mol. Mass.:
547.6437
SMILES:
CC(C)C[C@H](NC(=O)[C@H](C)NC(=O)[C@@H](NC(=O)[C@H](Cc1ccccc1)NC(=O)COC(C)=O)C(C)C)C(N)=O
: