Target
Prothrombin
Ligand
BDBM50056771
Substrate
Meas. Tech.
ChEBML_208361
Ki
5±n/a nM
Citation
 Lyle, TAChen, ZAppleby, SDFreidinger, RMGardell, SJLewis, SDLi, YLyle, EALynch, JJMulichak, AMNg, ASNaylor-Olsen, AMSanders, WM Synthesis, evaluation, and crystallographic analysis of L-371,912: A potent and selective active-site thrombin inhibitor Bioorg Med Chem Lett 7:67-72 (1997)    Article 
Target
Name:
Prothrombin
Synonyms:
Activation peptide fragment 1 Coagulation factor II Prothrombin precursor Thrombin heavy chain | Thrombin light chain
Type:
Protein
Mol. Mass.:
70029.57
Organism:
Homo sapiens (Human)
Description:
P00734
Residue:
622
  
Inhibitor
Name:
BDBM50056771
Synonyms:
(2S)-N-[(4-aminocyclohexyl)methyl]-1-[(2R)-2-(methylamino)-3-phenylpropanoyl]pyrrolidine-2-carboxamide
Type:
Small organic molecule
Emp. Form.:
C22H34N4O2
Mol. Mass.:
386.531
SMILES:
CN[C@H](Cc1ccccc1)C(=O)N1CCC[C@H]1C(=O)NC[C@H]1CCC(N)CC1
: