Target
Dual specificity calcium/calmodulin-dependent 3',5'-cyclic nucleotide phosphodiesterase 1A/1B/1C
Ligand
BDBM50289366
Substrate
Meas. Tech.
ChEMBL_155545 (CHEMBL759913)
IC50
1820±n/a nM
Citation
 Hlasta, DJBode, DCCourt, JJDesai, RCPagani, EDSilver, PJ Imidazotriazinone inhibitors of the Ca2+-calmodulin sensitive phosphodiesterase (PDE I) Bioorg Med Chem Lett 7:89-94 (1997)    Article 
Target
Name:
Dual specificity calcium/calmodulin-dependent 3',5'-cyclic nucleotide phosphodiesterase 1A/1B/1C
Synonyms:
Phosphodiesterase 1
Type:
Mol. Mass.:
Description:
Combinations of UniProts
Components:
This complex has 3 components.
Component 1
Name:
Dual specificity calcium/calmodulin-dependent 3',5'-cyclic nucleotide phosphodiesterase 1C
Synonyms:
3',5'-cyclic-AMP phosphodiesterase Calcium/calmodulin-dependent 3',5'-cyclic nucleotide phosphodiesterase 1C Hcam3 PDE1C_HUMAN Phosphodiesterase 1C | Phosphodiesterase, PDE1/PDE5
Type:
Enzyme
Mol. Mass.:
80778.58
Organism:
Homo sapiens (Human)
Description:
Q14123
Residue:
709
  
Component 2
Name:
Dual specificity calcium/calmodulin-dependent 3',5'-cyclic nucleotide phosphodiesterase 1A
Synonyms:
61 kDa Cam-PDE Cam-PDE 1A PDE1A_HUMAN | hCam-1
Type:
Protein
Mol. Mass.:
61245.69
Organism:
Homo sapiens (Human)
Description:
P54750
Residue:
535
  
Component 3
Name:
Dual specificity calcium/calmodulin-dependent 3',5'-cyclic nucleotide phosphodiesterase 1B
Synonyms:
63 kDa Cam-PDE Calcium/calmodulin-dependent 3',5'-cyclic nucleotide phosphodiesterase 1B PDE1B PDE1B_HUMAN Phosphodiesterase 1B Phosphodiesterase Type 1 (PDE1B) | Phosphodiesterase, PDE1/PDE5
Type:
Enzyme
Mol. Mass.:
61366.51
Organism:
Homo sapiens (Human)
Description:
Residue:
536
  
Inhibitor
Name:
BDBM50289366
Synonyms:
CHEMBL366491 | N-[4-(2,3-Dibromo-5-oxo-5,6-dihydro-imidazo[1,2-d][1,2,4]triazin-8-yl)-phenyl]-acetamide
Type:
Small organic molecule
Emp. Form.:
C13H9Br2N5O2
Mol. Mass.:
427.051
SMILES:
CC(=O)Nc1ccc(cc1)-c1n[nH]c(=O)n2c(Br)c(Br)nc12
: