Target
Beta-1/Beta-2/Beta-3 adrenergic receptor
Ligand
BDBM50289372
Substrate
Meas. Tech.
ChEMBL_215874 (CHEMBL821284)
IC50
1540±n/a nM
Citation
 Iseki, KOishi, SSasai, HShibasaki, M SYNTHESIS AND BIOLOGICAL EVALUATION OF A FLUORINATED ANALOG OF THE β-ADRENERGIC BLOCKING AGENT, METOPROLOL Bioorg Med Chem Lett 7:1273-1274 (1997)    Article 
Target
Name:
Beta-1/Beta-2/Beta-3 adrenergic receptor
Synonyms:
Adrenergic receptor beta
Type:
Mol. Mass.:
Description:
ASSAY_ID of ChEMBL is 1340543
Components:
This complex has 3 components.
Component 1
Name:
Beta-1 adrenergic receptor
Synonyms:
ADRB1R, B1AR Adrb1 Adrenergic receptor beta Beta-1 adrenoreceptor adrenergic Beta1,2
Type:
Protein
Mol. Mass.:
50486.84
Organism:
Rattus norvegicus (Rat)
Description:
P18090
Residue:
466
  
Component 2
Name:
Beta-2 adrenergic receptor
Synonyms:
ADRB2_RAT Adrb2r | Adrenergic receptor beta
Type:
PROTEIN
Mol. Mass.:
46896.26
Organism:
Rattus norvegicus
Description:
ChEMBL_38603
Residue:
418
  
Component 3
Name:
Beta-3 adrenergic receptor
Synonyms:
ADRB3_RAT Adrb3r Beta-3 adrenergic receptor
Type:
PROTEIN
Mol. Mass.:
43161.83
Organism:
Rattus norvegicus
Description:
ChEMBL_1509452
Residue:
400
  
Inhibitor
Name:
BDBM50289372
Synonyms:
(S)-1,1-Difluoro-3-isopropylamino-1-[4-(2-methoxy-ethyl)-phenoxy]-propan-2-ol | CHEMBL23929
Type:
Small organic molecule
Emp. Form.:
C15H23F2NO3
Mol. Mass.:
303.3448
SMILES:
COCCc1ccc(OC(F)(F)[C@@H](O)CNC(C)C)cc1
: