Target
Caspase-1
Ligand
BDBM50289410
Substrate
Meas. Tech.
ChEBML_90985
Ki
0.150000±n/a nM
Citation
 Semple, GAshworth, DMBaker, GRBatt, ARBaxter, AJBenzies, DWElliot, LHEvans, DFranklin, RJHudson, PJenkins, PDPitt, GRRooker, DPSheppard, ASzelke, MYamamoto, SIsomura, Y PYRIDONE-BASED PEPTIDOMIMETIC INHIBITORS OF INTERLEUKIN-1β-CONVERTING ENZYME (ICE) Bioorg Med Chem Lett 7:1337-1342 (1997)    Article 
Target
Name:
Caspase-1
Synonyms:
CASP1 Caspase ICE IL1BCE Interleukin-1 beta-converting enzyme
Type:
Enzyme
Mol. Mass.:
45154.13
Organism:
Homo sapiens (Human)
Description:
P29466
Residue:
404
  
Inhibitor
Name:
BDBM50289410
Synonyms:
CHEMBL26544 | Peptidic phenyl ketoether analogue
Type:
Small organic molecule
Emp. Form.:
C30H33N3O7
Mol. Mass.:
547.5989
SMILES:
CC(C)[C@H](NC(=O)c1ccc2ccccc2c1)C(=O)N[C@@H](C)C(=O)NC(CC(O)=O)C(=O)COc1ccccc1
: