Target
Caspase-1
Ligand
BDBM50289414
Substrate
Meas. Tech.
ChEBML_90985
Ki
40±n/a nM
Citation
 Semple, GAshworth, DMBaker, GRBatt, ARBaxter, AJBenzies, DWElliot, LHEvans, DFranklin, RJHudson, PJenkins, PDPitt, GRRooker, DPSheppard, ASzelke, MYamamoto, SIsomura, Y PYRIDONE-BASED PEPTIDOMIMETIC INHIBITORS OF INTERLEUKIN-1β-CONVERTING ENZYME (ICE) Bioorg Med Chem Lett 7:1337-1342 (1997)    Article 
Target
Name:
Caspase-1
Synonyms:
CASP1 Caspase ICE IL1BCE Interleukin-1 beta-converting enzyme
Type:
Enzyme
Mol. Mass.:
45154.13
Organism:
Homo sapiens (Human)
Description:
P29466
Residue:
404
  
Inhibitor
Name:
BDBM50289414
Synonyms:
(S)-3-(2-{6-Hexyl-3-[(naphthalene-1-carbonyl)-amino]-2-oxo-2H-pyridin-1-yl}-acetylamino)-4-oxo-5-phenoxy-pentanoic acid | CHEMBL287020
Type:
Small organic molecule
Emp. Form.:
C35H37N3O7
Mol. Mass.:
611.6842
SMILES:
CCCCCCc1ccc(NC(=O)c2cccc3ccccc23)c(=O)n1CC(=O)N[C@@H](CC(O)=O)C(=O)COc1ccccc1
: