Target
Sigma non-opioid intracellular receptor 1
Ligand
BDBM50289549
Substrate
Meas. Tech.
ChEBML_201293
IC50
6±n/a nM
Citation
 Mantegani, SBrambilla, ECremonesi, PCaccia, CFornaretto, MGCarfagna, NColombo, MMcArthur, RAVarasi, M (E) and (Z)-3-Styrylpiperidines as sigma ligands Bioorg Med Chem Lett 7:1525-1530 (1997)    Article 
Target
Name:
Sigma non-opioid intracellular receptor 1
Synonyms:
Opioid receptor SGMR1_RAT Sigma non-opioid intracellular receptor 1 Sigma-1 | Sigmar1
Type:
Enzyme Catalytic Domain
Mol. Mass.:
25266.54
Organism:
RAT
Description:
Q9R0C9
Residue:
223
  
Inhibitor
Name:
BDBM50289549
Synonyms:
1-Cyclohexyl-3-((E)-styryl)-piperidine | CHEMBL291228
Type:
Small organic molecule
Emp. Form.:
C19H27N
Mol. Mass.:
269.4244
SMILES:
C1CCC(CC1)N1CCCC(C1)\C=C\c1ccccc1
: