Target
Sigma non-opioid intracellular receptor 1
Ligand
BDBM50289551
Substrate
Meas. Tech.
ChEBML_201293
IC50
7±n/a nM
Citation
 Mantegani, SBrambilla, ECremonesi, PCaccia, CFornaretto, MGCarfagna, NColombo, MMcArthur, RAVarasi, M (E) and (Z)-3-Styrylpiperidines as sigma ligands Bioorg Med Chem Lett 7:1525-1530 (1997)    Article 
Target
Name:
Sigma non-opioid intracellular receptor 1
Synonyms:
Opioid receptor SGMR1_RAT Sigma non-opioid intracellular receptor 1 Sigma-1 | Sigmar1
Type:
Enzyme Catalytic Domain
Mol. Mass.:
25266.54
Organism:
RAT
Description:
Q9R0C9
Residue:
223
  
Inhibitor
Name:
BDBM50289551
Synonyms:
1-(4-Phenyl-butyl)-3-((Z)-styryl)-piperidine | CHEMBL39818
Type:
Small organic molecule
Emp. Form.:
C23H29N
Mol. Mass.:
319.4831
SMILES:
C(CCc1ccccc1)CN1CCCC(C1)\C=C/c1ccccc1
: