Target
5-hydroxytryptamine receptor 2A
Ligand
BDBM50289609
Substrate
Meas. Tech.
ChEBML_2673
Ki
9±n/a nM
Citation
 Mokrosz, MJDuszynska, BKlodzinska, ADeren-Wesolek, AChojnacka-Wójcik, EBaranowski, TCAbdou, IMRedmore, NPStrekowski, L 4-(3-furyl)-2-(4-methylpiperazino)pyrimidines: Potent 5-HT2A receptor antagonists Bioorg Med Chem Lett 7:1635-1638 (1997)    Article 
Target
Name:
5-hydroxytryptamine receptor 2A
Synonyms:
5-HT-2A 5-HT2A 5-hydroxytryptamine receptor 2A (5HT2A) Htr2 Serotonin Receptor 2A
Type:
G Protein-Coupled Receptor (GPCR)
Mol. Mass.:
52852.05
Organism:
Rattus norvegicus (rat)
Description:
Rat cortex membranes 5-HT2A receptors.
Residue:
471
  
Inhibitor
Name:
BDBM50289609
Synonyms:
4-Furan-3-yl-2-(4-methyl-piperazin-1-yl)-6-phenyl-pyrimidine | CHEMBL43434
Type:
Small organic molecule
Emp. Form.:
C19H20N4O
Mol. Mass.:
320.3883
SMILES:
CN1CCN(CC1)c1nc(cc(n1)-c1ccccc1)-c1ccoc1
: