Target
5-hydroxytryptamine receptor 1A
Ligand
BDBM50289606
Substrate
Meas. Tech.
ChEBML_1434
Ki
484±n/a nM
Citation
 Mokrosz, MJDuszynska, BKlodzinska, ADeren-Wesolek, AChojnacka-Wójcik, EBaranowski, TCAbdou, IMRedmore, NPStrekowski, L 4-(3-furyl)-2-(4-methylpiperazino)pyrimidines: Potent 5-HT2A receptor antagonists Bioorg Med Chem Lett 7:1635-1638 (1997)    Article 
Target
Name:
5-hydroxytryptamine receptor 1A
Synonyms:
5-HT-1A 5-HT1A 5-hydroxytryptamine receptor 1A (5HT1A) 5ht1a Htr1a Serotonin 1a (5-HT1a) receptor/Adrenergic receptor alpha-1 | Serotonin receptor 1A
Type:
G Protein-Coupled Receptor (GPCR)
Mol. Mass.:
46445.29
Organism:
Rattus norvegicus (rat)
Description:
Binding assays were performed using rat hippocampal membranes.
Residue:
422
  
Inhibitor
Name:
BDBM50289606
Synonyms:
2-(4-Methyl-piperazin-1-yl)-4-thiophen-2-yl-pyrimidine | CHEMBL42261
Type:
Small organic molecule
Emp. Form.:
C13H16N4S
Mol. Mass.:
260.358
SMILES:
CN1CCN(CC1)c1nccc(n1)-c1cccs1
: