Target
Aldo-keto reductase family 1 member B1
Ligand
BDBM50289629
Substrate
Meas. Tech.
ChEBML_31798
IC50
9.5±n/a nM
Citation
 Aotsuka, TAbe, NFukushima, KAshizawa, NYoshida, M Benzothiazol-2-ylcarboxylic acids with diverse spacers: A novel class of potent, orally active aldose reductase inhibitors Bioorg Med Chem Lett 7:1677-1682 (1997)    Article 
Target
Name:
Aldo-keto reductase family 1 member B1
Synonyms:
AKR1B1 ALR2 Aldose reductase
Type:
PROTEIN
Mol. Mass.:
35865.31
Organism:
Sus scrofa
Description:
ChEMBL_502637
Residue:
316
  
Inhibitor
Name:
BDBM50289629
Synonyms:
CHEMBL47646 | [3-Oxo-4-(4,5,7-trifluoro-benzothiazol-2-ylmethyl)-3,4-dihydro-2H-benzo[1,4]thiazin-2-yl]-acetic acid
Type:
Small organic molecule
Emp. Form.:
C18H11F3N2O3S2
Mol. Mass.:
424.417
SMILES:
OC(=O)CC1Sc2ccccc2N(Cc2nc3c(F)c(F)cc(F)c3s2)C1=O
: