Target
Nitric oxide synthase, endothelial
Ligand
BDBM50289681
Substrate
Meas. Tech.
ChEBML_65319
Ki
270±n/a nM
Citation
 Shearer, BGLee, SFranzmann, KWWhite, HASanders, DCKiff, RJGarvey, EPFurfine, ES Conformationally restricted arginine analogues as inhibitors of human nitric oxide synthase Bioorg Med Chem Lett 7:1763-1768 (1997)    Article 
Target
Name:
Nitric oxide synthase, endothelial
Synonyms:
Constitutive NOS Endothelial NOS NOS type III NOS3_HUMAN Nitric oxide synthase (inducible and endothelial) Nitric-oxide synthase (endothelial and brain) eNOS
Type:
Enzyme Catalytic Domain
Mol. Mass.:
133297.84
Organism:
Homo sapiens (Human)
Description:
P29474
Residue:
1203
  
Inhibitor
Name:
BDBM50289681
Synonyms:
2-Amino-3-[2-(N'-methyl-guanidino)-phenyl]-propionic acid | CHEMBL49881
Type:
Small organic molecule
Emp. Form.:
C11H16N4O2
Mol. Mass.:
236.2703
SMILES:
CNC(N)=Nc1ccccc1CC(N)C(O)=O
: