Target
Alpha-1A/Alpha-1B/Alpha-1D adrenergic receptor
Ligand
BDBM50289781
Substrate
Meas. Tech.
ChEMBL_32407 (CHEMBL872271)
Ki
4±n/a nM
Citation
 Reitz, ABMcDonnell, MEBaxter, EWCodd, EEWu, WN The synthesis and evaluation of the major metabolites of mazapertine Bioorg Med Chem Lett 7:1927-1930 (1997)    Article 
Target
Name:
Alpha-1A/Alpha-1B/Alpha-1D adrenergic receptor
Synonyms:
Adrenergic receptor alpha-1 alpha-1 Adrenergic Receptor
Type:
Mol. Mass.:
Description:
ASSAY_ID of EBI is 303470
Components:
This complex has 3 components.
Component 1
Name:
Alpha-1B adrenergic receptor
Synonyms:
ADA1B_RAT Alpha 1B-adrenoceptor Alpha adrenergic receptor 1A and 1B Alpha-1Adrenoceptor Alpha-1B adrenoreceptor | adrenergic Alpha1B
Type:
G Protein-Coupled Receptor (GPCR)
Mol. Mass.:
56606.71
Organism:
Rattus norvegicus (rat)
Description:
Receptor binding assays were performed using rat cortical membranes.
Residue:
515
  
Component 2
Name:
Alpha-1A adrenergic receptor
Synonyms:
ADA1A_RAT Adra1c Alpha-1A adrenoceptor Alpha-1C adrenergic receptor | adrenergic Alpha1A
Type:
Protein
Mol. Mass.:
51620.15
Organism:
Rattus norvegicus (Rat)
Description:
P43140
Residue:
466
  
Component 3
Name:
Alpha-1D adrenergic receptor
Synonyms:
ADA1D_RAT Adra1d Alpha-1D adrenergic receptor | Serotonin 1a (5-HT1a) receptor/Adrenergic receptor alpha-1
Type:
Protein
Mol. Mass.:
59375.97
Organism:
Rattus norvegicus (Rat)
Description:
P23944
Residue:
561
  
Inhibitor
Name:
BDBM50289781
Synonyms:
(2-Hydroxy-piperidin-1-yl)-{3-[4-(2-isopropoxy-phenyl)-piperazin-1-ylmethyl]-phenyl}-methanone | CHEMBL58517
Type:
Small organic molecule
Emp. Form.:
C26H35N3O3
Mol. Mass.:
437.5744
SMILES:
CC(C)Oc1ccccc1N1CCN(Cc2cccc(c2)C(=O)N2CCCCC2O)CC1
: