Target
Alpha-2A adrenergic receptor [16-465]
Ligand
BDBM50289986
Substrate
Meas. Tech.
ChEBML_30086
IC50
>10000±n/a nM
Citation
 Becker, DPNosal, RVillamil, CIGullikson, GMoummi, CYang, DCFlynn, DL Serotonin 5-HT4 agonist activity of a series of meso-azanoradamantane benzamides Bioorg Med Chem Lett 7:2149-2154 (1997)    Article 
Target
Name:
Alpha-2A adrenergic receptor [16-465]
Synonyms:
ADA2A_RAT Adrenaline 2 Alpha-2A adrenoceptor Alpha-2AAR Alpha2 Adrenoreceptor adrenergic Alpha2A
Type:
G-protein coupled receptor
Mol. Mass.:
48961.69
Organism:
Rattus norvegicus (rat)
Description:
P22909[16-465]
Residue:
450
  
Inhibitor
Name:
BDBM50289986
Synonyms:
4-Amino-N-(1-aza-tricyclo[3.3.1.0*3,7*]non-4-yl)-5-chloro-2-methoxy-benzamide; hydrochloride SC-52491
Type:
Small organic molecule
Emp. Form.:
C16H20ClN3O2
Mol. Mass.:
321.802
SMILES:
COc1cc(N)c(Cl)cc1C(=O)NC1C2CC3CN(CC13)C2
: