Target
Beta-lactamase TEM
Ligand
BDBM50021959
Substrate
Meas. Tech.
ChEBML_40561
IC50
40±n/a nM
Citation
 Pfaendler, HRWeishaupt, RMedicus, C Synthesis and biological activity of novel penem sulfoxides and sulfones Bioorg Med Chem Lett 7:2217-2222 (1997)    Article 
Target
Name:
Beta-lactamase TEM
Synonyms:
BLAT_ECOLX Beta-lactamase (TEM-1) Beta-lactamase TEM-1 Beta-lactamase TEM1D Beta-lactamase TEM1F TEM extended-spectrum beta-lactamase bla
Type:
Enzyme
Mol. Mass.:
31512.33
Organism:
Escherichia coli
Description:
P62593
Residue:
286
  
Inhibitor
Name:
BDBM50021959
Synonyms:
CHEMBL777 US9120808, Clavulanic acid potassium salt clavulanic acid
Type:
Small organic molecule
Emp. Form.:
C8H9NO5
Mol. Mass.:
199.1608
SMILES:
OC\C=C1/O[C@@H]2CC(=O)N2[C@H]1C(O)=O
: