Target
Sigma non-opioid intracellular receptor 1
Ligand
BDBM50290097
Substrate
Meas. Tech.
ChEBML_201429
Ki
3±n/a nM
Citation
 Yamashita, ATakahashi, NMochizuki, DTsujita, RYamada, SKawakubo, HSuzuki, YWatanabe, H An aromatic moiety is not essential for pharmacophore binding to sigma binding sites: Synthesis of N-alkylazacycloheptane derivatives as potent sigma ligands Bioorg Med Chem Lett 7:2303-2306 (1997)    Article 
Target
Name:
Sigma non-opioid intracellular receptor 1
Synonyms:
Aging-associated gene 8 protein SGMR1_HUMAN SIGMAR1 SR31747-binding protein Sigma 1-type opioid receptor Sigma1R | hSigmaR1
Type:
Enzyme Catalytic Domain
Mol. Mass.:
25124.85
Organism:
Homo sapiens (Human)
Description:
Q99720
Residue:
223
  
Inhibitor
Name:
BDBM50290097
Synonyms:
(S)-3-Cyclohexyl-1,8,8-trimethyl-3-aza-bicyclo[3.2.1]octane | CHEMBL74499
Type:
Small organic molecule
Emp. Form.:
C16H29N
Mol. Mass.:
235.4082
SMILES:
CC1(C)C2CC[C@]1(C)CN(C2)C1CCCCC1
: