Target
Sodium-dependent serotonin transporter
Ligand
BDBM82548
Substrate
Ki
77.8±n/a nM
Comments
PDSP_4623
Citation
 Cheetham, SCViggers, JASlater, NAHeal, DJBuckett, WR [3H]paroxetine binding in rat frontal cortex strongly correlates with [3H]5-HT uptake: effect of administration of various antidepressant treatments. Neuropharmacology 32:737-43 (1993)  
Target
Name:
Sodium-dependent serotonin transporter
Synonyms:
5-HT Transporter 5HT transporter Anandamid membrane transporter, AMT Monoamine transporters; Norepinephrine & serotonin Slc6a4 Sodium-dependent serotonin transporter (SERT) | imipramine receptor
Type:
Multi-pass membrane protein
Mol. Mass.:
70168.43
Organism:
Rattus norvegicus (rat)
Description:
P31652
Residue:
630
  
Inhibitor
Name:
BDBM82548
Synonyms:
CAS_897-15-4 NSC_3155
Type:
Small organic molecule
Emp. Form.:
C19H21NS
Mol. Mass.:
295.442
SMILES:
CN(C)CCC=C1c2ccccc2CSc2ccccc12
: