Target
Sodium-dependent serotonin transporter
Ligand
BDBM50010859
Substrate
Ki
14.2±n/a nM
Comments
PDSP_973
Citation
 Cheetham, SCViggers, JASlater, NAHeal, DJBuckett, WR [3H]paroxetine binding in rat frontal cortex strongly correlates with [3H]5-HT uptake: effect of administration of various antidepressant treatments. Neuropharmacology 32:737-43 (1993)  
Target
Name:
Sodium-dependent serotonin transporter
Synonyms:
5-HT Transporter 5HT transporter Anandamid membrane transporter, AMT Monoamine transporters; Norepinephrine & serotonin Slc6a4 Sodium-dependent serotonin transporter (SERT) | imipramine receptor
Type:
Multi-pass membrane protein
Mol. Mass.:
70168.43
Organism:
Rattus norvegicus (rat)
Description:
P31652
Residue:
630
  
Inhibitor
Name:
BDBM50010859
Synonyms:
CHEMBL11 IMIPRAMINE PAMOATE | Imipramin
Type:
Small organic molecule
Emp. Form.:
C19H24N2
Mol. Mass.:
280.4073
SMILES:
CN(C)CCCN1c2ccccc2CCc2ccccc12
: