Target
Retinoic acid receptor alpha
Ligand
BDBM50290138
Substrate
Meas. Tech.
ChEBML_195161
Ki
>4000±n/a nM
Citation
 Wong, MFRepa, JJClagett-Dame, MCurley, RW Synthesis and receptor binding affinity of conformationally restricted retinoic acid analogues Bioorg Med Chem Lett 7:2313-2318 (1997)    Article 
Target
Name:
Retinoic acid receptor alpha
Synonyms:
NR1B1 RAR-alpha RARA_HUMAN Retinoic acid receptor alpha/Retinoid X receptor alpha Retinoid receptor
Type:
PROTEIN
Mol. Mass.:
50778.87
Organism:
Homo sapiens (Human)
Description:
ChEMBL_1466191
Residue:
462
  
Inhibitor
Name:
BDBM50290138
Synonyms:
(2Z,4E)-3-Methyl-5-{2-[(E)-2-(3,3,6,6-tetramethyl-cyclohex-1-enyl)-vinyl]-cyclopropyl}-penta-2,4-dienoic acid | CHEMBL73973
Type:
Small organic molecule
Emp. Form.:
C21H30O2
Mol. Mass.:
314.4617
SMILES:
C\C(\C=C\C1CC1\C=C\C1=CC(C)(C)CCC1(C)C)=C\C(O)=O
: