Target
Retinoic acid receptor gamma
Ligand
BDBM50290137
Substrate
Meas. Tech.
ChEBML_196016
Ki
32±n/a nM
Citation
 Wong, MFRepa, JJClagett-Dame, MCurley, RW Synthesis and receptor binding affinity of conformationally restricted retinoic acid analogues Bioorg Med Chem Lett 7:2313-2318 (1997)    Article 
Target
Name:
Retinoic acid receptor gamma
Synonyms:
NR1B3 RAR-gamma RARG_HUMAN Retinoic acid receptor gamma | Retinoid receptor
Type:
PROTEIN
Mol. Mass.:
50345.43
Organism:
Homo sapiens (Human)
Description:
ChEMBL_1458016
Residue:
454
  
Inhibitor
Name:
BDBM50290137
Synonyms:
(2E,4E)-3-Methyl-5-{2-[(E)-2-(3,3,6,6-tetramethyl-cyclohex-1-enyl)-vinyl]-cyclopropyl}-penta-2,4-dienoic acid | CHEMBL74331
Type:
Small organic molecule
Emp. Form.:
C21H30O2
Mol. Mass.:
314.4617
SMILES:
C\C(\C=C\C1CC1\C=C\C1=CC(C)(C)CCC1(C)C)=C/C(O)=O
: