Target
Retinoic acid receptor beta
Ligand
BDBM50290181
Substrate
Meas. Tech.
ChEMBL_195797 (CHEMBL802568)
EC50
280±n/a nM
Citation
 Beard, RLTeng, MColon, DFDuong, TTThacher, SMArefieg, TChandraratna, RA Synthesis and biological activity of 1,2,3,4-tetrahydroquinoline and 3,4-(1H)-dihydroquinolin-2-one analogs of retinoic acid Bioorg Med Chem Lett 7:2373-2378 (1997)    Article 
Target
Name:
Retinoic acid receptor beta
Synonyms:
HAP NR1B2 RAR-beta RARB Retinoic acid receptor RXR-alpha/Retinoic acid receptor beta Retinoid receptor
Type:
PROTEIN
Mol. Mass.:
50498.70
Organism:
Homo sapiens (Human)
Description:
ChEMBL_1458015
Residue:
455
  
Inhibitor
Name:
BDBM50290181
Synonyms:
4-(1-Heptyl-4,4-dimethyl-1,2,3,4-tetrahydro-quinolin-6-ylethynyl)-benzoic acid | CHEMBL308967
Type:
Small organic molecule
Emp. Form.:
C27H33NO2
Mol. Mass.:
403.5564
SMILES:
CCCCCCCN1CCC(C)(C)c2cc(ccc12)C#Cc1ccc(cc1)C(O)=O
: